pastebin

Paste Search Dynamic
Recent pastes
Error in aosp building for ma
  1. target Java: CtsSecurityTestCases (out/target/common/obj/APPS/CtsSecurityTestCases_intermediates/classes)
  2. cts/tests/tests/security/src/android/security/cts/StagefrightTest.java:42: error: cannot find symbol
  3.         doStagefrightTest(R.raw.cve_2015_1538_1);
  4.                                ^
  5.   symbol:   variable cve_2015_1538_1
  6.   location: class raw
  7. cts/tests/tests/security/src/android/security/cts/StagefrightTest.java:45: error: cannot find symbol
  8.         doStagefrightTest(R.raw.cve_2015_1538_2);
  9.                                ^
  10.   symbol:   variable cve_2015_1538_2
  11.   location: class raw
  12. cts/tests/tests/security/src/android/security/cts/StagefrightTest.java:48: error: cannot find symbol
  13.         doStagefrightTest(R.raw.cve_2015_1538_3);
  14.                                ^
  15.   symbol:   variable cve_2015_1538_3
  16.   location: class raw
  17. cts/tests/tests/security/src/android/security/cts/StagefrightTest.java:51: error: cannot find symbol
  18.         doStagefrightTest(R.raw.cve_2015_1538_4);
  19.                                ^
  20.   symbol:   variable cve_2015_1538_4
  21.   location: class raw
  22. cts/tests/tests/security/src/android/security/cts/StagefrightTest.java:54: error: cannot find symbol
  23.         doStagefrightTest(R.raw.cve_2015_1539);
  24.                                ^
  25.   symbol:   variable cve_2015_1539
  26.   location: class raw
  27. cts/tests/tests/security/src/android/security/cts/StagefrightTest.java:57: error: cannot find symbol
  28.         doStagefrightTest(R.raw.cve_2015_3824);
  29.                                ^
  30.   symbol:   variable cve_2015_3824
  31.   location: class raw
  32. cts/tests/tests/security/src/android/security/cts/StagefrightTest.java:60: error: cannot find symbol
  33.         doStagefrightTest(R.raw.cve_2015_3827);
  34.                                ^
  35.   symbol:   variable cve_2015_3827
  36.   location: class raw
  37. cts/tests/tests/security/src/android/security/cts/StagefrightTest.java:63: error: cannot find symbol
  38.         doStagefrightTest(R.raw.cve_2015_3828);
  39.                                ^
  40.   symbol:   variable cve_2015_3828
  41.   location: class raw
  42. cts/tests/tests/security/src/android/security/cts/StagefrightTest.java:66: error: cannot find symbol
  43.         doStagefrightTest(R.raw.cve_2015_3829);
  44.                                ^
  45.   symbol:   variable cve_2015_3829
  46.   location: class raw
  47. cts/tests/tests/security/src/android/security/cts/StagefrightTest.java:69: error: cannot find symbol
  48.         doStagefrightTest(R.raw.cve_2015_3864);
  49.                                ^
  50.   symbol:   variable cve_2015_3864
  51.   location: class raw
  52. Note: cts/tests/tests/security/src/android/security/cts/BrowserTest.java uses or overrides a deprecated API.
  53. Note: Recompile with -Xlint:deprecation for details.
  54. Note: cts/tests/tests/security/src/android/security/cts/NetdTest.java uses unchecked or unsafe operations.
  55. Note: Recompile with -Xlint:unchecked for details.
  56. 10 errors
  57. build/core/java.mk:394: recipe for target 'out/target/common/obj/APPS/CtsSecurityTestCases_intermediates/classes-full-debug.jar' failed
  58. make: *** [out/target/common/obj/APPS/CtsSecurityTestCases_intermediates/classes-full-debug.jar] Error 41
  59.  
Parsed in 0.008 seconds